سلام

من یه بار شانسی ARWpost را ران کردم

البته کامبایل شدش

ولی الآن اینو میده:

 

FOUND the following input files:
 /home/eftekhar/q/0/WRFV3/test/em_real/wrfout_d01_2007-05-28_00:00:00

START PROCESSING DATA
 
   WARNING --- I do not recognize this data.
               OUTPUT FROM *             PROGRAM:WRF/CHEM V3.5.1 MODEL
               Will make an attempt to read it.
 

 Processing  time --- 2007-05-28_00:00:00
   Found the right date - continue
*** Error in `./ARWpost.exe': free(): invalid pointer: 0xf640f008 ***
======= Backtrace: =========
/lib/libc.so.6[0x4e3c9143]
/lib/libc.so.6[0x4e3d0cba]
./ARWpost.exe[0x8067fb1]
./ARWpost.exe[0x806992a]
./ARWpost.exe[0x805caa4]
./ARWpost.exe[0x805f78d]
./ARWpost.exe[0x804bdc8]
./ARWpost.exe[0x811762c]
/lib/libc.so.6(__libc_start_main+0xf3)[0x4e374b73]
======= Memory map: ========
08048000-08190000 r-xp 00000000 fd:02 27789326                           /home/eftekhar/q/0/ARWpost/src/ARWpost.exe
08190000-08191000 rw-p 00148000 fd:02 27789326                           /home/eftekhar/q/0/ARWpost/src/ARWpost.exe
08191000-09789000 rw-p 00000000 00:00 0
0ab99000-0ac48000 rw-p 00000000 00:00 0                                  [heap]
4e338000-4e357000 r-xp 00000000 fd:00 1443352                            /usr/lib/ld-2.18.so
4e357000-4e358000 r--p 0001e000 fd:00 1443352                            /usr/lib/ld-2.18.so
4e358000-4e359000 rw-p 0001f000 fd:00 1443352                            /usr/lib/ld-2.18.so
4e35b000-4e513000 r-xp 00000000 fd:00 1464828                            /usr/lib/libc-2.18.so
4e513000-4e514000 ---p 001b8000 fd:00 1464828                            /usr/lib/libc-2.18.so
4e514000-4e516000 r--p 001b8000 fd:00 1464828                            /usr/lib/libc-2.18.so
4e516000-4e517000 rw-p 001ba000 fd:00 1464828                            /usr/lib/libc-2.18.so
4e517000-4e51a000 rw-p 00000000 00:00 0
f637f000-f750d000 rw-p 00000000 00:00 0
f750d000-f7587000 r-xp 00000000 fd:00 1482915                            /usr/lib/libquadmath.so.0.0.0
f7587000-f7588000 r--p 0007a000 fd:00 1482915                            /usr/lib/libquadmath.so.0.0.0
f7588000-f7589000 rw-p 0007b000 fd:00 1482915                            /usr/lib/libquadmath.so.0.0.0
f7589000-f758a000 rw-p 00000000 00:00 0
f758a000-f75a5000 r-xp 00000000 fd:00 1482912                            /usr/lib/libgcc_s-4.8.3-20140911.so.1
f75a5000-f75a6000 r--p 0001a000 fd:00 1482912                            /usr/lib/libgcc_s-4.8.3-20140911.so.1
f75a6000-f75a7000 rw-p 0001b000 fd:00 1482912                            /usr/lib/libgcc_s-4.8.3-20140911.so.1
f75a7000-f75ec000 r-xp 00000000 fd:00 1473250                            /usr/lib/libm-2.18.so
f75ec000-f75ed000 r--p 00044000 fd:00 1473250                            /usr/lib/libm-2.18.so
f75ed000-f75ee000 rw-p 00045000 fd:00 1473250                            /usr/lib/libm-2.18.so
f75ee000-f76ef000 r-xp 00000000 fd:00 1482917                            /usr/lib/libgfortran.so.3.0.0
f76ef000-f76f0000 r--p 00100000 fd:00 1482917                            /usr/lib/libgfortran.so.3.0.0
f76f0000-f76f1000 rw-p 00101000 fd:00 1482917                            /usr/lib/libgfortran.so.3.0.0
f7721000-f7723000 rw-p 00000000 00:00 0
f7723000-f7725000 r--p 00000000 00:00 0                                  [vvar]
f7725000-f7727000 r-xp 00000000 00:00 0                                  [vdso]
ffeef000-fff11000 rw-p 00000000 00:00 0                                  [stack]
Aborted (core dumped)

 

جالب اینه که ۲ باره ران میکنی اینو میده:

 

!!!!!!!!!!!!!!!!
  ARWpost v2.2
!!!!!!!!!!!!!!!!

FOUND the following input files:
 /home/eftekhar/q/0/WRFV3/test/em_real/wrfout_d01_2007-05-28_00:00:00

START PROCESSING DATA
 
   WARNING --- I do not recognize this data.
               OUTPUT FROM *             PROGRAM:WRF/CHEM V3.5.1 MODEL
               Will make an attempt to read it.
 

 Processing  time --- 2007-05-28_00:00:00
   Found the right date - continue
Segmentation fault (core dumped)

 

موقع کامبایل هم:

 

**** Compiling ARWpost ****
 
/home/eftekhar/q/0ha/00/ARWpost/
/bin/rm -f module_get_file_names.o module_get_file_names.mod
/lib/cpp -C -P -traditional -DIO_NETCDF -DIO_GRIB1 -DIO_BINARY -DRECL4  -Dbytesw  -DV5D  -I/home/eftekhar/q/0ha/00/ARWpost/../WRFV3/external/io_netcdf -I/home/eftekhar/q/0ha/00/ARWpost/../WRFV3/external/io_grib_share -I/home/eftekhar/q/0ha/00/ARWpost/../WRFV3/external/io_grib1 -I/home/eftekhar/q/0ha/00/ARWpost/../WRFV3/external/io_int -I/home/eftekhar/q/0ha/00/ARWpost/../WRFV3/inc module_get_file_names.F90 > module_get_file_names.f
gfortran -ffree-form -O -fno-second-underscore -fconvert=big-endian -frecord-marker=4  -c module_get_file_names.f -I/home/eftekhar/q/0ha/00/ARWpost/../WRFV3/external/io_netcdf -I/home/eftekhar/q/0ha/00/ARWpost/../WRFV3/external/io_grib_share -I/home/eftekhar/q/0ha/00/ARWpost/../WRFV3/external/io_grib1 -I/home/eftekhar/q/0ha/00/ARWpost/../WRFV3/external/io_int -I/home/eftekhar/q/0ha/00/ARWpost/../WRFV3/inc
module_get_file_names.f:1.1:

/* Copyright (C) 1991-2013 Free Software Foundation, Inc.
 1
Error: Invalid character in name at (1)
module_get_file_names.f:2.3:

   This file is part of the GNU C Library.
   1
Error: Unclassifiable statement at (1)
module_get_file_names.f:4.3:

   The GNU C Library is free software; you can redistribute it and/or
   1
Error: Unclassifiable statement at (1)
module_get_file_names.f:4.39:

   The GNU C Library is free software; you can redistribute it and/or
                                       1
Error: Unclassifiable statement at (1)
module_get_file_names.f:5.3:

   modify it under the terms of the GNU Lesser General Public
   1
Error: Unclassifiable statement at (1)
module_get_file_names.f:6.3:

   License as published by the Free Software Foundation; either
   1
Error: Unclassifiable statement at (1)
module_get_file_names.f:6.57:

   License as published by the Free Software Foundation; either
                                                         1
Error: Unclassifiable statement at (1)
module_get_file_names.f:7.3:

   version 2.1 of the License, or (at your option) any later version.
   1
Error: Unclassifiable statement at (1)
module_get_file_names.f:9.3:

   The GNU C Library is distributed in the hope that it will be useful,
   1
Error: Unclassifiable statement at (1)
module_get_file_names.f:10.3:

   but WITHOUT ANY WARRANTY; without even the implied warranty of
   1
Error: Unclassifiable statement at (1)
module_get_file_names.f:10.29:

   but WITHOUT ANY WARRANTY; without even the implied warranty of
                             1
Error: Unclassifiable statement at (1)
module_get_file_names.f:11.3:

   MERCHANTABILITY or FITNESS FOR A PARTICULAR PURPOSE.  See the GNU
   1
Error: Unclassifiable statement at (1)
module_get_file_names.f:12.3:

   Lesser General Public License for more details.
   1
Error: Unclassifiable statement at (1)
module_get_file_names.f:14.3:

   You should have received a copy of the GNU Lesser General Public
   1
Error: Unclassifiable statement at (1)
module_get_file_names.f:15.3:

   License along with the GNU C Library; if not, see
   1
Error: Unclassifiable statement at (1)
module_get_file_names.f:15.41:

   License along with the GNU C Library; if not, see
                                         1
Error: Unclassifiable statement at (1)
module_get_file_names.f:16.4:

   <http://www.gnu.org/licenses/>.  */
    1
Error: Invalid character in name at (1)
module_get_file_names.f:19.1:

/* This header is separate from features.h so that the compiler can
 1
Error: Invalid character in name at (1)
module_get_file_names.f:20.3:

   include it implicitly at the start of every compilation.  It must
   1
Error: Unclassifiable statement at (1)
module_get_file_names.f:21.3:

   not itself include <features.h> or any other header that includes
   1
Error: Unclassifiable statement at (1)
module_get_file_names.f:22.4:

   <features.h> because the implicit include comes before any feature
    1
Error: Invalid character in name at (1)
module_get_file_names.f:23.3:

   test macros that may be defined in a source file before it first
   1
Error: Unclassifiable statement at (1)
module_get_file_names.f:24.3:

   explicitly includes a system header.  GCC knows the name of this
   1
Error: Unclassifiable statement at (1)
module_get_file_names.f:25.3:

   header in order to preinclude it.  */
   1
Error: Unclassifiable statement at (1)
module_get_file_names.f:27.1:

/* We do support the IEC 559 math functionality, real and complex.  */
 1
Error: Invalid character in name at (1)
Fatal Error: Error count reached limit of 25.
make: [module_get_file_names.o] Error 1 (ignored)
/bin/rm -f module_get_file_names.f
/bin/rm -f gridinfo_module.o gridinfo_module.mod
/lib/cpp -C -P -traditional -DIO_NETCDF -DIO_GRIB1 -DIO_BINARY -DRECL4  -Dbytesw  -DV5D  -I/home/eftekhar/q/0ha/00/ARWpost/../WRFV3/external/io_netcdf -I/home/eftekhar/q/0ha/00/ARWpost/../WRFV3/external/io_grib_share -I/home/eftekhar/q/0ha/00/ARWpost/../WRFV3/external/io_grib1 -I/home/eftekhar/q/0ha/00/ARWpost/../WRFV3/external/io_int -I/home/eftekhar/q/0ha/00/ARWpost/../WRFV3/inc gridinfo_module.F90 > gridinfo_module.f
gfortran -ffree-form -O -fno-second-underscore -fconvert=big-endian -frecord-marker=4  -c gridinfo_module.f -I/home/eftekhar/q/0ha/00/ARWpost/../WRFV3/external/io_netcdf -I/home/eftekhar/q/0ha/00/ARWpost/../WRFV3/external/io_grib_share -I/home/eftekhar/q/0ha/00/ARWpost/../WRFV3/external/io_grib1 -I/home/eftekhar/q/0ha/00/ARWpost/../WRFV3/external/io_int -I/home/eftekhar/q/0ha/00/ARWpost/../WRFV3/inc
gridinfo_module.f:1.1:

/* Copyright (C) 1991-2013 Free Software Foundation, Inc.
 1
Error: Invalid character in name at (1)
gridinfo_module.f:2.3:

   This file is part of the GNU C Library.
   1
Error: Unclassifiable statement at (1)
gridinfo_module.f:4.3:

   The GNU C Library is free software; you can redistribute it and/or
   1
Error: Unclassifiable statement at (1)
gridinfo_module.f:4.39:

   The GNU C Library is free software; you can redistribute it and/or
                                       1
Error: Unclassifiable statement at (1)
gridinfo_module.f:5.3:

   modify it under the terms of the GNU Lesser General Public
   1
Error: Unclassifiable statement at (1)
gridinfo_module.f:6.3:

   License as published by the Free Software Foundation; either
   1
Error: Unclassifiable statement at (1)
gridinfo_module.f:6.57:

   License as published by the Free Software Foundation; either
                                                         1
Error: Unclassifiable statement at (1)
gridinfo_module.f:7.3:

   version 2.1 of the License, or (at your option) any later version.
   1
Error: Unclassifiable statement at (1)
gridinfo_module.f:9.3:

   The GNU C Library is distributed in the hope that it will be useful,
   1
Error: Unclassifiable statement at (1)
gridinfo_module.f:10.3:

   but WITHOUT ANY WARRANTY; without even the implied warranty of
   1
Error: Unclassifiable statement at (1)
gridinfo_module.f:10.29:

   but WITHOUT ANY WARRANTY; without even the implied warranty of
                             1
Error: Unclassifiable statement at (1)
gridinfo_module.f:11.3:

   MERCHANTABILITY or FITNESS FOR A PARTICULAR PURPOSE.  See the GNU
   1
Error: Unclassifiable statement at (1)
gridinfo_module.f:12.3:

   Lesser General Public License for more details.
   1
Error: Unclassifiable statement at (1)
gridinfo_module.f:14.3:

   You should have received a copy of the GNU Lesser General Public
   1
Error: Unclassifiable statement at (1)
gridinfo_module.f:15.3:

   License along with the GNU C Library; if not, see
   1
Error: Unclassifiable statement at (1)
gridinfo_module.f:15.41:

   License along with the GNU C Library; if not, see
                                         1
Error: Unclassifiable statement at (1)
gridinfo_module.f:16.4:

   <http://www.gnu.org/licenses/>.  */
    1
Error: Invalid character in name at (1)
gridinfo_module.f:19.1:

/* This header is separate from features.h so that the compiler can
 1
Error: Invalid character in name at (1)
gridinfo_module.f:20.3:

   include it implicitly at the start of every compilation.  It must
   1
Error: Unclassifiable statement at (1)
gridinfo_module.f:21.3:

   not itself include <features.h> or any other header that includes
   1
Error: Unclassifiable statement at (1)
gridinfo_module.f:22.4:

   <features.h> because the implicit include comes before any feature
    1
Error: Invalid character in name at (1)
gridinfo_module.f:23.3:

   test macros that may be defined in a source file before it first
   1
Error: Unclassifiable statement at (1)
gridinfo_module.f:24.3:

   explicitly includes a system header.  GCC knows the name of this
   1
Error: Unclassifiable statement at (1)
gridinfo_module.f:25.3:

   header in order to preinclude it.  */
   1
Error: Unclassifiable statement at (1)
gridinfo_module.f:27.1:

/* We do support the IEC 559 math functionality, real and complex.  */
 1
Error: Invalid character in name at (1)
Fatal Error: Error count reached limit of 25.
make: [gridinfo_module.o] Error 1 (ignored)
/bin/rm -f gridinfo_module.f
/bin/rm -f queue_module.o queue_module.mod
/lib/cpp -C -P -traditional -DIO_NETCDF -DIO_GRIB1 -DIO_BINARY -DRECL4  -Dbytesw  -DV5D  -I/home/eftekhar/q/0ha/00/ARWpost/../WRFV3/external/io_netcdf -I/home/eftekhar/q/0ha/00/ARWpost/../WRFV3/external/io_grib_share -I/home/eftekhar/q/0ha/00/ARWpost/../WRFV3/external/io_grib1 -I/home/eftekhar/q/0ha/00/ARWpost/../WRFV3/external/io_int -I/home/eftekhar/q/0ha/00/ARWpost/../WRFV3/inc queue_module.F90 > queue_module.f
gfortran -ffree-form -O -fno-second-underscore -fconvert=big-endian -frecord-marker=4  -c queue_module.f -I/home/eftekhar/q/0ha/00/ARWpost/../WRFV3/external/io_netcdf -I/home/eftekhar/q/0ha/00/ARWpost/../WRFV3/external/io_grib_share -I/home/eftekhar/q/0ha/00/ARWpost/../WRFV3/external/io_grib1 -I/home/eftekhar/q/0ha/00/ARWpost/../WRFV3/external/io_int -I/home/eftekhar/q/0ha/00/ARWpost/../WRFV3/inc
queue_module.f:1.1:

/* Copyright (C) 1991-2013 Free Software Foundation, Inc.
 1
Error: Invalid character in name at (1)
queue_module.f:2.3:

   This file is part of the GNU C Library.
   1
Error: Unclassifiable statement at (1)
queue_module.f:4.3:

   The GNU C Library is free software; you can redistribute it and/or
   1
Error: Unclassifiable statement at (1)
queue_module.f:4.39:

   The GNU C Library is free software; you can redistribute it and/or
                                       1
Error: Unclassifiable statement at (1)
queue_module.f:5.3:

   modify it under the terms of the GNU Lesser General Public
   1
Error: Unclassifiable statement at (1)
queue_module.f:6.3:

   License as published by the Free Software Foundation; either
   1
Error: Unclassifiable statement at (1)
queue_module.f:6.57:

   License as published by the Free Software Foundation; either
                                                         1
Error: Unclassifiable statement at (1)
queue_module.f:7.3:

   version 2.1 of the License, or (at your option) any later version.
   1
Error: Unclassifiable statement at (1)
queue_module.f:9.3:

   The GNU C Library is distributed in the hope that it will be useful,
   1
Error: Unclassifiable statement at (1)
queue_module.f:10.3:

   but WITHOUT ANY WARRANTY; without even the implied warranty of
   1
Error: Unclassifiable statement at (1)
queue_module.f:10.29:

   but WITHOUT ANY WARRANTY; without even the implied warranty of
                             1
Error: Unclassifiable statement at (1)
queue_module.f:11.3:

   MERCHANTABILITY or FITNESS FOR A PARTICULAR PURPOSE.  See the GNU
   1
Error: Unclassifiable statement at (1)
queue_module.f:12.3:

   Lesser General Public License for more details.
   1
Error: Unclassifiable statement at (1)
queue_module.f:14.3:

   You should have received a copy of the GNU Lesser General Public
   1
Error: Unclassifiable statement at (1)
queue_module.f:15.3:

   License along with the GNU C Library; if not, see
   1
Error: Unclassifiable statement at (1)
queue_module.f:15.41:

   License along with the GNU C Library; if not, see
                                         1
Error: Unclassifiable statement at (1)
queue_module.f:16.4:

   <http://www.gnu.org/licenses/>.  */
    1
Error: Invalid character in name at (1)
queue_module.f:19.1:

/* This header is separate from features.h so that the compiler can
 1
Error: Invalid character in name at (1)
queue_module.f:20.3:

   include it implicitly at the start of every compilation.  It must
   1
Error: Unclassifiable statement at (1)
queue_module.f:21.3:

   not itself include <features.h> or any other header that includes
   1
Error: Unclassifiable statement at (1)
queue_module.f:22.4:

   <features.h> because the implicit include comes before any feature
    1
Error: Invalid character in name at (1)
queue_module.f:23.3:

   test macros that may be defined in a source file before it first
   1
Error: Unclassifiable statement at (1)
queue_module.f:24.3:

   explicitly includes a system header.  GCC knows the name of this
   1
Error: Unclassifiable statement at (1)
queue_module.f:25.3:

   header in order to preinclude it.  */
   1
Error: Unclassifiable statement at (1)
queue_module.f:27.1:

/* We do support the IEC 559 math functionality, real and complex.  */
 1
Error: Invalid character in name at (1)
Fatal Error: Error count reached limit of 25.
make: [queue_module.o] Error 1 (ignored)
/bin/rm -f queue_module.f
/bin/rm -f input_module.o input_module.mod
/lib/cpp -C -P -traditional -DIO_NETCDF -DIO_GRIB1 -DIO_BINARY -DRECL4  -Dbytesw  -DV5D  -I/home/eftekhar/q/0ha/00/ARWpost/../WRFV3/external/io_netcdf -I/home/eftekhar/q/0ha/00/ARWpost/../WRFV3/external/io_grib_share -I/home/eftekhar/q/0ha/00/ARWpost/../WRFV3/external/io_grib1 -I/home/eftekhar/q/0ha/00/ARWpost/../WRFV3/external/io_int -I/home/eftekhar/q/0ha/00/ARWpost/../WRFV3/inc input_module.F90 > input_module.f
gfortran -ffree-form -O -fno-second-underscore -fconvert=big-endian -frecord-marker=4  -c input_module.f -I/home/eftekhar/q/0ha/00/ARWpost/../WRFV3/external/io_netcdf -I/home/eftekhar/q/0ha/00/ARWpost/../WRFV3/external/io_grib_share -I/home/eftekhar/q/0ha/00/ARWpost/../WRFV3/external/io_grib1 -I/home/eftekhar/q/0ha/00/ARWpost/../WRFV3/external/io_int -I/home/eftekhar/q/0ha/00/ARWpost/../WRFV3/inc
input_module.f:1.1:

/* Copyright (C) 1991-2013 Free Software Foundation, Inc.
 1
Error: Invalid character in name at (1)
input_module.f:2.3:

   This file is part of the GNU C Library.
   1
Error: Unclassifiable statement at (1)
input_module.f:4.3:

   The GNU C Library is free software; you can redistribute it and/or
   1
Error: Unclassifiable statement at (1)
input_module.f:4.39:

   The GNU C Library is free software; you can redistribute it and/or
                                       1
Error: Unclassifiable statement at (1)
input_module.f:5.3:

   modify it under the terms of the GNU Lesser General Public
   1
Error: Unclassifiable statement at (1)
input_module.f:6.3:

   License as published by the Free Software Foundation; either
   1
Error: Unclassifiable statement at (1)
input_module.f:6.57:

   License as published by the Free Software Foundation; either
                                                         1
Error: Unclassifiable statement at (1)
input_module.f:7.3:

   version 2.1 of the License, or (at your option) any later version.
   1
Error: Unclassifiable statement at (1)
input_module.f:9.3:

   The GNU C Library is distributed in the hope that it will be useful,
   1
Error: Unclassifiable statement at (1)
input_module.f:10.3:

   but WITHOUT ANY WARRANTY; without even the implied warranty of
   1
Error: Unclassifiable statement at (1)
input_module.f:10.29:

   but WITHOUT ANY WARRANTY; without even the implied warranty of
                             1
Error: Unclassifiable statement at (1)
input_module.f:11.3:

   MERCHANTABILITY or FITNESS FOR A PARTICULAR PURPOSE.  See the GNU
   1
Error: Unclassifiable statement at (1)
input_module.f:12.3:

   Lesser General Public License for more details.
   1
Error: Unclassifiable statement at (1)
input_module.f:14.3:

   You should have received a copy of the GNU Lesser General Public
   1
Error: Unclassifiable statement at (1)
input_module.f:15.3:

   License along with the GNU C Library; if not, see
   1
Error: Unclassifiable statement at (1)
input_module.f:15.41:

   License along with the GNU C Library; if not, see
                                         1
Error: Unclassifiable statement at (1)
input_module.f:16.4:

   <http://www.gnu.org/licenses/>.  */
    1
Error: Invalid character in name at (1)
input_module.f:19.1:

/* This header is separate from features.h so that the compiler can
 1
Error: Invalid character in name at (1)
input_module.f:20.3:

   include it implicitly at the start of every compilation.  It must
   1
Error: Unclassifiable statement at (1)
input_module.f:21.3:

   not itself include <features.h> or any other header that includes
   1
Error: Unclassifiable statement at (1)
input_module.f:22.4:

   <features.h> because the implicit include comes before any feature
    1
Error: Invalid character in name at (1)
input_module.f:23.3:

   test macros that may be defined in a source file before it first
   1
Error: Unclassifiable statement at (1)
input_module.f:24.3:

   explicitly includes a system header.  GCC knows the name of this
   1
Error: Unclassifiable statement at (1)
input_module.f:25.3:

   header in order to preinclude it.  */
   1
Error: Unclassifiable statement at (1)
input_module.f:27.1:

/* We do support the IEC 559 math functionality, real and complex.  */
 1
Error: Invalid character in name at (1)
Fatal Error: Error count reached limit of 25.
make: [input_module.o] Error 1 (ignored)
/bin/rm -f input_module.f
/bin/rm -f module_arrays.o module_arrays.mod
/bin/cp module_arrays.f90 module_arrays.f
gfortran -ffree-form -O -fno-second-underscore -fconvert=big-endian -frecord-marker=4  -c module_arrays.f -I/home/eftekhar/q/0ha/00/ARWpost/../WRFV3/external/io_netcdf -I/home/eftekhar/q/0ha/00/ARWpost/../WRFV3/external/io_grib_share -I/home/eftekhar/q/0ha/00/ARWpost/../WRFV3/external/io_grib1 -I/home/eftekhar/q/0ha/00/ARWpost/../WRFV3/external/io_int -I/home/eftekhar/q/0ha/00/ARWpost/../WRFV3/inc
module_arrays.f:79.6:

  USE gridinfo_module
      1
Fatal Error: Can't open module file 'gridinfo_module.mod' for reading at (1): No such file or directory
make: [module_arrays.o] Error 1 (ignored)
/bin/rm -f module_arrays.f
/bin/rm -f module_interp.o module_interp.mod
/bin/cp module_interp.f90 module_interp.f
gfortran -ffree-form -O -fno-second-underscore -fconvert=big-endian -frecord-marker=4  -c module_interp.f -I/home/eftekhar/q/0ha/00/ARWpost/../WRFV3/external/io_netcdf -I/home/eftekhar/q/0ha/00/ARWpost/../WRFV3/external/io_grib_share -I/home/eftekhar/q/0ha/00/ARWpost/../WRFV3/external/io_grib1 -I/home/eftekhar/q/0ha/00/ARWpost/../WRFV3/external/io_int -I/home/eftekhar/q/0ha/00/ARWpost/../WRFV3/inc
module_interp.f:3.7:

   USE input_module
       1
Fatal Error: Can't open module file 'input_module.mod' for reading at (1): No such file or directory
make: [module_interp.o] Error 1 (ignored)
/bin/rm -f module_interp.f
/bin/rm -f output_module.o output_module.mod
/lib/cpp -C -P -traditional -DIO_NETCDF -DIO_GRIB1 -DIO_BINARY -DRECL4  -Dbytesw  -DV5D  -I/home/eftekhar/q/0ha/00/ARWpost/../WRFV3/external/io_netcdf -I/home/eftekhar/q/0ha/00/ARWpost/../WRFV3/external/io_grib_share -I/home/eftekhar/q/0ha/00/ARWpost/../WRFV3/external/io_grib1 -I/home/eftekhar/q/0ha/00/ARWpost/../WRFV3/external/io_int -I/home/eftekhar/q/0ha/00/ARWpost/../WRFV3/inc output_module.F90 > output_module.f
gfortran -ffree-form -O -fno-second-underscore -fconvert=big-endian -frecord-marker=4  -c output_module.f -I/home/eftekhar/q/0ha/00/ARWpost/../WRFV3/external/io_netcdf -I/home/eftekhar/q/0ha/00/ARWpost/../WRFV3/external/io_grib_share -I/home/eftekhar/q/0ha/00/ARWpost/../WRFV3/external/io_grib1 -I/home/eftekhar/q/0ha/00/ARWpost/../WRFV3/external/io_int -I/home/eftekhar/q/0ha/00/ARWpost/../WRFV3/inc
output_module.f:1.1:

/* Copyright (C) 1991-2013 Free Software Foundation, Inc.
 1
Error: Invalid character in name at (1)
output_module.f:2.3:

   This file is part of the GNU C Library.
   1
Error: Unclassifiable statement at (1)
output_module.f:4.3:

   The GNU C Library is free software; you can redistribute it and/or
   1
Error: Unclassifiable statement at (1)
output_module.f:4.39:

   The GNU C Library is free software; you can redistribute it and/or
                                       1
Error: Unclassifiable statement at (1)
output_module.f:5.3:

   modify it under the terms of the GNU Lesser General Public
   1
Error: Unclassifiable statement at (1)
output_module.f:6.3:

   License as published by the Free Software Foundation; either
   1
Error: Unclassifiable statement at (1)
output_module.f:6.57:

   License as published by the Free Software Foundation; either
                                                         1
Error: Unclassifiable statement at (1)
output_module.f:7.3:

   version 2.1 of the License, or (at your option) any later version.
   1
Error: Unclassifiable statement at (1)
output_module.f:9.3:

   The GNU C Library is distributed in the hope that it will be useful,
   1
Error: Unclassifiable statement at (1)
output_module.f:10.3:

   but WITHOUT ANY WARRANTY; without even the implied warranty of
   1
Error: Unclassifiable statement at (1)
output_module.f:10.29:

   but WITHOUT ANY WARRANTY; without even the implied warranty of
                             1
Error: Unclassifiable statement at (1)
output_module.f:11.3:

   MERCHANTABILITY or FITNESS FOR A PARTICULAR PURPOSE.  See the GNU
   1
Error: Unclassifiable statement at (1)
output_module.f:12.3:

   Lesser General Public License for more details.
   1
Error: Unclassifiable statement at (1)
output_module.f:14.3:

   You should have received a copy of the GNU Lesser General Public
   1
Error: Unclassifiable statement at (1)
output_module.f:15.3:

   License along with the GNU C Library; if not, see
   1
Error: Unclassifiable statement at (1)
output_module.f:15.41:

   License along with the GNU C Library; if not, see
                                         1
Error: Unclassifiable statement at (1)
output_module.f:16.4:

   <http://www.gnu.org/licenses/>.  */
    1
Error: Invalid character in name at (1)
output_module.f:19.1:

/* This header is separate from features.h so that the compiler can
 1
Error: Invalid character in name at (1)
output_module.f:20.3:

   include it implicitly at the start of every compilation.  It must
   1
Error: Unclassifiable statement at (1)
output_module.f:21.3:

   not itself include <features.h> or any other header that includes
   1
Error: Unclassifiable statement at (1)
output_module.f:22.4:

   <features.h> because the implicit include comes before any feature
    1
Error: Invalid character in name at (1)
output_module.f:23.3:

   test macros that may be defined in a source file before it first
   1
Error: Unclassifiable statement at (1)
output_module.f:24.3:

   explicitly includes a system header.  GCC knows the name of this
   1
Error: Unclassifiable statement at (1)
output_module.f:25.3:

   header in order to preinclude it.  */
   1
Error: Unclassifiable statement at (1)
output_module.f:27.1:

/* We do support the IEC 559 math functionality, real and complex.  */
 1
Error: Invalid character in name at (1)
Fatal Error: Error count reached limit of 25.
make: [output_module.o] Error 1 (ignored)
/bin/rm -f output_module.f
/bin/rm -f v5d_module.o v5d_module.mod
/bin/cp v5d_module.f90 v5d_module.f
gfortran -ffree-form -O -fno-second-underscore -fconvert=big-endian -frecord-marker=4  -c v5d_module.f -I/home/eftekhar/q/0ha/00/ARWpost/../WRFV3/external/io_netcdf -I/home/eftekhar/q/0ha/00/ARWpost/../WRFV3/external/io_grib_share -I/home/eftekhar/q/0ha/00/ARWpost/../WRFV3/external/io_grib1 -I/home/eftekhar/q/0ha/00/ARWpost/../WRFV3/external/io_int -I/home/eftekhar/q/0ha/00/ARWpost/../WRFV3/inc
v5d_module.f:3.7:

   USE gridinfo_module
       1
Fatal Error: Can't open module file 'gridinfo_module.mod' for reading at (1): No such file or directory
make: [v5d_module.o] Error 1 (ignored)
/bin/rm -f v5d_module.f
/bin/rm -f module_basic_arrays.o module_basic_arrays.mod
/bin/cp module_basic_arrays.f90 module_basic_arrays.f
gfortran -ffree-form -O -fno-second-underscore -fconvert=big-endian -frecord-marker=4  -c module_basic_arrays.f -I/home/eftekhar/q/0ha/00/ARWpost/../WRFV3/external/io_netcdf -I/home/eftekhar/q/0ha/00/ARWpost/../WRFV3/external/io_grib_share -I/home/eftekhar/q/0ha/00/ARWpost/../WRFV3/external/io_grib1 -I/home/eftekhar/q/0ha/00/ARWpost/../WRFV3/external/io_int -I/home/eftekhar/q/0ha/00/ARWpost/../WRFV3/inc
module_basic_arrays.f:3.6:

  USE gridinfo_module
      1
Fatal Error: Can't open module file 'gridinfo_module.mod' for reading at (1): No such file or directory
make: [module_basic_arrays.o] Error 1 (ignored)
/bin/rm -f module_basic_arrays.f
/bin/rm -f module_diagnostics.o module_diagnostics.mod
/bin/cp module_diagnostics.f90 module_diagnostics.f
gfortran -ffree-form -O -fno-second-underscore -fconvert=big-endian -frecord-marker=4  -c module_diagnostics.f -I/home/eftekhar/q/0ha/00/ARWpost/../WRFV3/external/io_netcdf -I/home/eftekhar/q/0ha/00/ARWpost/../WRFV3/external/io_grib_share -I/home/eftekhar/q/0ha/00/ARWpost/../WRFV3/external/io_grib1 -I/home/eftekhar/q/0ha/00/ARWpost/../WRFV3/external/io_int -I/home/eftekhar/q/0ha/00/ARWpost/../WRFV3/inc
module_diagnostics.f:6.6:

  USE output_module
      1
Fatal Error: Can't open module file 'output_module.mod' for reading at (1): No such file or directory
make: [module_diagnostics.o] Error 1 (ignored)
/bin/rm -f module_diagnostics.f
/bin/rm -f process_domain_module.o process_domain_module.mod
/lib/cpp -C -P -traditional -DIO_NETCDF -DIO_GRIB1 -DIO_BINARY -DRECL4  -Dbytesw  -DV5D  -I/home/eftekhar/q/0ha/00/ARWpost/../WRFV3/external/io_netcdf -I/home/eftekhar/q/0ha/00/ARWpost/../WRFV3/external/io_grib_share -I/home/eftekhar/q/0ha/00/ARWpost/../WRFV3/external/io_grib1 -I/home/eftekhar/q/0ha/00/ARWpost/../WRFV3/external/io_int -I/home/eftekhar/q/0ha/00/ARWpost/../WRFV3/inc process_domain_module.F90 > process_domain_module.f
gfortran -ffree-form -O -fno-second-underscore -fconvert=big-endian -frecord-marker=4  -c process_domain_module.f -I/home/eftekhar/q/0ha/00/ARWpost/../WRFV3/external/io_netcdf -I/home/eftekhar/q/0ha/00/ARWpost/../WRFV3/external/io_grib_share -I/home/eftekhar/q/0ha/00/ARWpost/../WRFV3/external/io_grib1 -I/home/eftekhar/q/0ha/00/ARWpost/../WRFV3/external/io_int -I/home/eftekhar/q/0ha/00/ARWpost/../WRFV3/inc
process_domain_module.f:1.1:

/* Copyright (C) 1991-2013 Free Software Foundation, Inc.
 1
Error: Invalid character in name at (1)
process_domain_module.f:2.3:

   This file is part of the GNU C Library.
   1
Error: Unclassifiable statement at (1)
process_domain_module.f:4.3:

   The GNU C Library is free software; you can redistribute it and/or
   1
Error: Unclassifiable statement at (1)
process_domain_module.f:4.39:

   The GNU C Library is free software; you can redistribute it and/or
                                       1
Error: Unclassifiable statement at (1)
process_domain_module.f:5.3:

   modify it under the terms of the GNU Lesser General Public
   1
Error: Unclassifiable statement at (1)
process_domain_module.f:6.3:

   License as published by the Free Software Foundation; either
   1
Error: Unclassifiable statement at (1)
process_domain_module.f:6.57:

   License as published by the Free Software Foundation; either
                                                         1
Error: Unclassifiable statement at (1)
process_domain_module.f:7.3:

   version 2.1 of the License, or (at your option) any later version.
   1
Error: Unclassifiable statement at (1)
process_domain_module.f:9.3:

   The GNU C Library is distributed in the hope that it will be useful,
   1
Error: Unclassifiable statement at (1)
process_domain_module.f:10.3:

   but WITHOUT ANY WARRANTY; without even the implied warranty of
   1
Error: Unclassifiable statement at (1)
process_domain_module.f:10.29:

   but WITHOUT ANY WARRANTY; without even the implied warranty of
                             1
Error: Unclassifiable statement at (1)
process_domain_module.f:11.3:

   MERCHANTABILITY or FITNESS FOR A PARTICULAR PURPOSE.  See the GNU
   1
Error: Unclassifiable statement at (1)
process_domain_module.f:12.3:

   Lesser General Public License for more details.
   1
Error: Unclassifiable statement at (1)
process_domain_module.f:14.3:

   You should have received a copy of the GNU Lesser General Public
   1
Error: Unclassifiable statement at (1)
process_domain_module.f:15.3:

   License along with the GNU C Library; if not, see
   1
Error: Unclassifiable statement at (1)
process_domain_module.f:15.41:

   License along with the GNU C Library; if not, see
                                         1
Error: Unclassifiable statement at (1)
process_domain_module.f:16.4:

   <http://www.gnu.org/licenses/>.  */
    1
Error: Invalid character in name at (1)
process_domain_module.f:19.1:

/* This header is separate from features.h so that the compiler can
 1
Error: Invalid character in name at (1)
process_domain_module.f:20.3:

   include it implicitly at the start of every compilation.  It must
   1
Error: Unclassifiable statement at (1)
process_domain_module.f:21.3:

   not itself include <features.h> or any other header that includes
   1
Error: Unclassifiable statement at (1)
process_domain_module.f:22.4:

   <features.h> because the implicit include comes before any feature
    1
Error: Invalid character in name at (1)
process_domain_module.f:23.3:

   test macros that may be defined in a source file before it first
   1
Error: Unclassifiable statement at (1)
process_domain_module.f:24.3:

   explicitly includes a system header.  GCC knows the name of this
   1
Error: Unclassifiable statement at (1)
process_domain_module.f:25.3:

   header in order to preinclude it.  */
   1
Error: Unclassifiable statement at (1)
process_domain_module.f:27.1:

/* We do support the IEC 559 math functionality, real and complex.  */
 1
Error: Invalid character in name at (1)
Fatal Error: Error count reached limit of 25.
make: [process_domain_module.o] Error 1 (ignored)
/bin/rm -f process_domain_module.f
/bin/rm -f ARWpost.o ARWpost.mod
/bin/cp ARWpost.f90 ARWpost.f
gfortran -ffree-form -O -fno-second-underscore -fconvert=big-endian -frecord-marker=4  -c ARWpost.f -I/home/eftekhar/q/0ha/00/ARWpost/../WRFV3/external/io_netcdf -I/home/eftekhar/q/0ha/00/ARWpost/../WRFV3/external/io_grib_share -I/home/eftekhar/q/0ha/00/ARWpost/../WRFV3/external/io_grib1 -I/home/eftekhar/q/0ha/00/ARWpost/../WRFV3/external/io_int -I/home/eftekhar/q/0ha/00/ARWpost/../WRFV3/inc
ARWpost.f:9.7:

   USE gridinfo_module
       1
Fatal Error: Can't open module file 'gridinfo_module.mod' for reading at (1): No such file or directory
make: [ARWpost.o] Error 1 (ignored)
/bin/rm -f ARWpost.f
gfortran -ffree-form -O -fno-second-underscore -fconvert=big-endian -frecord-marker=4   -o ARWpost.exe wrf_debug.o module_model_basics.o constants_module.o gridinfo_module.o ARWpost.o input_module.o output_module.o module_map_utils.o v5d_module.o misc_definitions_module.o module_date_pack.o module_debug.o process_domain_module.o queue_module.o module_get_file_names.o module_interp.o module_basic_arrays.o module_diagnostics.o module_arrays.o module_pressure.o module_calc_height.o module_calc_pressure.o module_calc_theta.o module_calc_tk.o module_calc_tc.o module_calc_td.o module_calc_td2.o module_calc_rh.o module_calc_rh2.o module_calc_uvmet.o module_calc_slp.o module_calc_dbz.o module_calc_cape.o module_calc_wdir.o module_calc_wspd.o module_calc_clfr.o  \
    /home/eftekhar/q/0ha/00/ARWpost/../WRFV3/frame/module_internal_header_util.o  \
    /home/eftekhar/q/0ha/00/ARWpost/../WRFV3/frame/module_machine.o  \
    /home/eftekhar/q/0ha/00/ARWpost/../WRFV3/frame/pack_utils.o  \
    -L/home/eftekhar/q/0ha/00/ARWpost/netcdf_links/lib -I/home/eftekhar/q/0ha/00/ARWpost/netcdf_links/include  \
    -I/home/eftekhar/q/0ha/00/ARWpost/../WRFV3/external/io_grib1  \
    -I/home/eftekhar/q/0ha/00/ARWpost/../WRFV3/external/io_int  \
    -I/home/eftekhar/q/0ha/00/ARWpost/../WRFV3/external/io_netcdf  \
    -I/home/eftekhar/q/0ha/00/ARWpost/../WRFV3/external/io_grib_share  \
    -L/home/eftekhar/q/0ha/00/ARWpost/../WRFV3/external/io_netcdf  \
    -L/home/eftekhar/q/0ha/00/ARWpost/../WRFV3/external/io_grib1  \
    -L/home/eftekhar/q/0ha/00/ARWpost/../WRFV3/external/io_int  \
    -L/home/eftekhar/q/0ha/00/ARWpost/../WRFV3/external/io_grib_share  \
    -lwrfio_int -lwrfio_nf -lio_grib1 -lio_grib_share -lnetcdf \
    /usr/local/vis5d/src/binio.o /usr/local/vis5d/src/v5d.o
gfortran: error: gridinfo_module.o: No such file or directory
gfortran: error: ARWpost.o: No such file or directory
gfortran: error: input_module.o: No such file or directory
gfortran: error: output_module.o: No such file or directory
gfortran: error: v5d_module.o: No such file or directory
gfortran: error: process_domain_module.o: No such file or directory
gfortran: error: queue_module.o: No such file or directory
gfortran: error: module_get_file_names.o: No such file or directory
gfortran: error: module_interp.o: No such file or directory
gfortran: error: module_basic_arrays.o: No such file or directory
gfortran: error: module_diagnostics.o: No such file or directory
gfortran: error: module_arrays.o: No such file or directory
gfortran: error: /usr/local/vis5d/src/binio.o: No such file or directory
gfortran: error: /usr/local/vis5d/src/v5d.o: No such file or directory
make: [ARWpost.exe] Error 1 (ignored)

 

من که دیوامه شدم  ):

از اول ران wrf بیشتر از چند صد تا ارور رو حل کردم.

ممنون میشم اگر کمک کنید  (:

 

 

 

 

جمعه, 20/03/2015 - 20:37
تصویر arezu

سلام

با کسب اجازه از محضر دوستان باید بگم  اگر می خواید خروجی مدل wrf-chem رو پس پردازش کنید، از ncl  یا vapor و یا نرم افزاردیگه ای غیر از ARWpost  استفاده کنید، چون دچار مشکلات زیادی خواهید شد که گاها حل نمیشن.

اما در مورد ارورهای هنگام نصبتون اگر اشتباه نکنم  هنگام نصب باید چند تغییر کوچیک تو Make بدید، این تغییر ها رو انجام دادید؟

چون من ارورهاتون رو نگاه نکردم، پرسیدم.

موفق باشید.

برای ارسال دیدگاه وارد شوید یا ثبت نام کنید .